AnsweredAssumed Answered

any suggestions with this fail:

Question asked by Angel_GDL on Oct 10, 2016
Latest reply on Feb 2, 2017 by dbailey

Test 2100, Subtest 10, Module 3, Slot 1 FAILED.
ASRU card status register after reading
Result Received = 0000000000010000 Binary
Result Expected : xxxx000000000000 Binary

Test 2100, Subtest 13, Module 3, Slot 1 FAILED.
ASRU card status register after reading
Result Received = 0000000000010000 Binary
Result Expected : xxxx000000000000 Binary

Test 2125, Subtest 4, Module 3, Slot 1 FAILED.
MOA gain @ 8192Hz narrow band
Low Limit : 2.2E+01
Result expected : 2.5E+01
High Limit : 2.8E+01
Result Received : 4.7E+01 Decibels

Test 2125, Subtest 5, Module 3, Slot 1 FAILED.
MOA phase @ 8192Hz narrow band
Low Limit : -7.6E+01
Result expected : -7.3E+01
High Limit : -7.0E+01
Result Received : -8.1E+01 Degrees

Test 2348, Subtest 0, Module 3, Slot 1 FAILED.
Module power supplies -PPM(-10 V)
Low Limit : -1.05021500E+01
Result expected : -1.00000000E+01
High Limit : -9.49805100E+00
Result Received : -1.59754345E+01 Volts

Test 2348, Subtest 2, Module 3, Slot 1 FAILED.
Module power supplies(-10 V)
Low Limit : -1.05021500E+01
Result expected : -1.00000000E+01
High Limit : -9.49805100E+00
Result Received : -1.89030898E+01 Volts

Outcomes